Installation Scamp klappt nicht

Linux (Theli bezogen), Theli, GUI und Hilfsprogramme.
Forumsregeln
Bitte die Beiträge kurz fassen, so kann man sie nachher besser finden. Sollte ein Problem gelöst sein, dann einen neuen Beitrag eröffnen. Ebenso wenn die Ursache eine ganz andere ist, oder es Offtopic wird.

Installation Scamp klappt nicht

Beitragvon Nobse » Freitag 29. September 2017, 00:01

Hallo zusammen,

ich möchte nach einer längeren Pause wieder Astrofotografie betreiben und Theli verwenden.
Hatte es früher schon mal auf einem Rechner laufen.
Habe einen Rechner mit Ubuntu 16.04 aufgesetzt und die Installation versucht.
Theli hat geklappt, scheitere aber bei Scamp.
Habe die anderen Beiträge mit Tipps zur Installation schon gelesen und die Befehle versucht, bekomme aber trotzdem eine Fehlermeldung.
Code: Alles auswählen
/bin/bash ../libtool --tag=CC   --mode=link gcc -D_REENTRANT -g -O2   -o scamp astrefcat.o astrsolve.o astrstats.o catout.o check.o colour.o astrcplot.o cplot.o photcplot.o crossid.o fft.o fgroup.o field.o fitswcs.o header.o main.o makeit.o match.o merge.o misc.o mosaic.o photsolve.o prefs.o proper.o samples.o threads.o xml.o ./fits/libfits.a ./wcs/libwcs_c.a -L=/usr/lib/atlas -llapack_atlas -lcblas -latlas -lfftw3f_threads -lfftw3f -lm  -lpthread -lplplotd -lltdl -lm -lshp -lcsirocsa -lcsironn -lqhull -lqsastime
libtool: link: gcc -D_REENTRANT -g -O2 -o scamp astrefcat.o astrsolve.o astrstats.o catout.o check.o colour.o astrcplot.o cplot.o photcplot.o crossid.o fft.o fgroup.o field.o fitswcs.o header.o main.o makeit.o match.o merge.o misc.o mosaic.o photsolve.o prefs.o proper.o samples.o threads.o xml.o  ./fits/libfits.a ./wcs/libwcs_c.a -L=/usr/lib/atlas -llapack_atlas -lcblas -latlas -lfftw3f_threads -lfftw3f -lpthread -lplplotd /usr/lib/x86_64-linux-gnu/libltdl.so -ldl -lm -lshp -lcsirocsa -lcsironn -lqhull -lqsastime
/usr/bin/ld: cannot find -lshp
collect2: error: ld returned 1 exit status
Makefile:421: die Regel für Ziel „scamp“ scheiterte
make[3]: *** [scamp] Fehler 1
make[3]: Verzeichnis „/home/nobse/scamp-2.0.4/src“ wird verlassen
Makefile:492: die Regel für Ziel „all-recursive“ scheiterte
make[2]: *** [all-recursive] Fehler 1
make[2]: Verzeichnis „/home/nobse/scamp-2.0.4/src“ wird verlassen
Makefile:448: die Regel für Ziel „all-recursive“ scheiterte
make[1]: *** [all-recursive] Fehler 1
make[1]: Verzeichnis „/home/nobse/scamp-2.0.4“ wird verlassen
Makefile:356: die Regel für Ziel „all“ scheiterte
make: *** [all] Fehler 2

Für Tipps schon mal Danke im Voraus!
Gruß
Norbert
Nobse
 
Beiträge: 5
Registriert: Mittwoch 30. Januar 2013, 22:11

Re: Installation Scamp klappt nicht

Beitragvon copello » Freitag 29. September 2017, 08:00

Hallo Norbert,

Laut Fehlermeldung "cannot find -lshp" fehlt die Bibliothek libshp.
Mittels:

Code: Alles auswählen
>apt-file search libshp
libshp-dev: /usr/lib/x86_64-linux-gnu/libshp.a
libshp-dev: /usr/lib/x86_64-linux-gnu/libshp.so
libshp-dev: /usr/share/doc/libshp-dev/changelog.Debian.gz
libshp-dev: /usr/share/doc/libshp-dev/changelog.gz
libshp-dev: /usr/share/doc/libshp-dev/copyright
libshp2: /usr/lib/x86_64-linux-gnu/libshp.so.2
libshp2: /usr/lib/x86_64-linux-gnu/libshp.so.2.0.0
libshp2: /usr/share/doc/libshp2/changelog.Debian.gz
libshp2: /usr/share/doc/libshp2/changelog.gz
libshp2: /usr/share/doc/libshp2/copyright


kann man feststellen in welchem Paket diese steckt. Somit das entsprechende Paket installieren und
das Kompilieren sollte beim linken -lshp nicht mehr fehlschlagen.
copello
 
Beiträge: 5
Registriert: Freitag 5. Februar 2016, 08:10

Re: Installation Scamp klappt nicht

Beitragvon Nobse » Freitag 29. September 2017, 17:40

Super,

vielen Dank für den Hinweis, hat geklappt.
Bin nicht so bewandert in der Unix-Welt, gehöre zu den Windows-Geschädigten :wink: .

Nachdem nun Theli mit Scamp wieder läuft, kann ich als nächstes einen alten Datensatz mal durchlaufen lassen als Test.

Danke nochmals für die Hilfe!

Gruß Norbert
Nobse
 
Beiträge: 5
Registriert: Mittwoch 30. Januar 2013, 22:11


Zurück zu Installation und Ubuntheli

Wer ist online?

Mitglieder in diesem Forum: 0 Mitglieder und 1 Gast

cron